{"text_format":"1","workbook":"xlsx","n_sheets":4,"sheets":["Country","Income","Rate","WHTWorksheet"],"not_rendered":{"charts":0,"images":0,"macros":1,"external_links":0,"defined_names":6,"comments":0,"pivot_tables":0},"unopened":[],"bounds":{"document_bytes":16777216,"sheet_cells":100000,"rows_first":2000,"rows_last":500,"rows_between":2000,"halvings":0,"cell_chars":16384,"cell_head_chars":4096},"cells_cut":0,"cells_raw":0,"read":"whole","date_system":"1900"}

{"sheet":"Country","index":0,"n_rows":180,"n_cols":2,"rows_kept":180,"cut":false,"hidden":true,"merged":[]}
["Nation","Abbreviation"]
["AFGHANISTAN","AFG"]
["ALBANIA","ALB"]
["ALGERIA","ALG"]
["ANGOLA","ANG"]
["ANGUILLA","ANA"]
["ANTIGUA-BARBUDA","ANB"]
["ARGENTINA","ARG"]
["ARUBA","ARU"]
["ASCENSION","ASC"]
["AUSTRALIA","AUS"]
["AUSTRIA","AUA"]
["AZERBAIJAN","AZE"]
["BAHAMAS","BAH"]
["BAHRAIN","BAN"]
["BANGLADESH","BAG"]
["BARBADOS","BAR"]
["BELGIUM","BEL"]
["BELIZE","BEZ"]
["BERMUDA","BER"]
["BOLIVIA","BOL"]
["BOSNIA AND HERZEGOVINA","BOS"]
["BOTSWANA","BOT"]
["BRAZIL","BRA"]
["BRITISH VIRGIN ISLANDS","BVI"]
["BULGARIA","BUL"]
["BURKINA FASO","BUP"]
["BURUNDI","BUR"]
["CAMEROON","CAM"]
["CANADA","CAN"]
["CARICOM","CAR"]
["CAYMAN ISLANDS","CAI"]
["CHAD","CHA"]
["CHILE","CHE"]
["CHINA","CHI"]
["COLOMBIA","COL"]
["CONGO","CON"]
["CONGO,THE DEMOCRATIC REPUBLIC","CDR"]
["COSTA RICA","CRA"]
["CÔTE D'IVOIRE","CÔT"]
["CROATIA","CRO"]
["CUBA","CUB"]
["CYPRUS","CYO"]
["CZECH REPUBLIC","CZE"]
["DENMARK","DEN"]
["DOMINICA","DOM"]
["DOMINICAN REPUBLIC","DON"]
["DUBAI","DUB"]
["ECUADOR","ECU"]
["EGYPT","EGY"]
["EL SALVADOR","ESR"]
["ETHIOPIA","ETH"]
["FALKLAND ISLANDS (MALVINAS)","FAL"]
["FIJI","FIJ"]
["FINLAND","FIN"]
["FRANCE","FRA"]
["FRENCH GUIANA","FRG"]
["FRENCH POLYNESIA","FRP"]
["GAMBIA","GAM"]
["GERMANY","GER"]
["GHANA","GHA"]
["GIBRALTAR","GIB"]
["GREECE","GRE"]
["GREENLAND","GRD"]
["GRENADA","GRA"]
["GUADELOUPE","GUE"]
["GUATEMALA","GUA"]
["GUYANA","GUY"]
["HAITI","HA"]
["HOLY SEE (VATICAN CITY STATE)","HOS"]
["HONDURAS","HON"]
["HUNGARY","HUN"]
["ICELAND","ICE"]
["INDIA","IND"]
["INDONESIA","INA"]
["IRAN","IRA"]
["IRAQ","IRQ"]
["IRELAND","IRE"]
["ISRAEL","ISR"]
["ITALY","ITA"]
{"$rows_left_out":101}
{"sheet":"Income","index":1,"n_rows":31,"n_cols":2,"rows_kept":31,"cut":false,"hidden":true,"merged":[]}
["Payment Type","Abbreviation"]
["Alimony Payment","PAL"]
["Branch Profit","BRP"]
["Commercial Debt - Claims","PCD"]
["Director's Fees Payment","PDF"]
["Dividends (Preference)","DPR"]
["Dividends paid to Individual","DID"]
["Dividends to Co.owning 10%","D10"]
["Dividends to Co.owning 25%","D25"]
["Dividends to Co.owning 50%","D50"]
["Dividends to Company","DCO"]
["Dividends to Parent Company","DPC"]
["Interest paid to Banks","PIB"]
["Interest paid to Bks-Germany","PIG"]
["Interest paid to Company","PIC"]
["Interest paid to Financial Ist","PIF"]
["Interest paid to Individual","PII"]
["Other Payments","POT"]
["Payment Mgt. fees - Company","PMC"]
["Payment Mgt. fees - Individual","PMI"]
["Payment Mgt. fees - US Corp.","PMU"]
["Pensions from Government","PPG"]
["Pensions from Private Company","PPP"]
["Pro. Ser. Artiste/Athlete","PPA"]
["Professional Services","PPS"]
["Rental of Equipment","PRE"]
["Rents on Immovable Property","PRT"]
["Royalties paid on Film","PRF"]
["Royalties paid on Literary","PRL"]
["Royalties paid to Company","PRC"]
["Royalties paid to Individual","PRI"]

{"sheet":"Rate","index":2,"n_rows":32,"n_cols":34,"rows_kept":32,"cut":false,"hidden":true,"merged":[[0,2,0,33],[2,0,31,0]]}
[null,null,"Country"]
[null,null,"ANB","BAH","BAR","BEZ","BRA","CAN","CAR","CHI","DEN","DOM","FRA","GER","GRA","GUY","HA","IND","ITA","JAM","LUX","MON","NOR","OTH","SKN","SPA","STA","SUR","SVG","SWE","SWI","UNK","USA","VEN"]
["Income Code","BRP",0.03,0.03,0.03,0.03,0.03,0.03,0.03,0.03,0.03,0.03,0.03,0.03,0.03,0.03,0.03,0.03,0.03,0.03,0.03,0.03,0.03,0.03,0.03,0,0.03,0.03,0.03,0.03,0.03,0.03,0.03,0.03]
[null,"D10",0,0.08,0,0,0.08,0.05,0.08,0.08,0.08,0,0.08,0.08,0,0,0.08,0.08,0.08,0,0.05,0.08,0.08,0.08,0,0.08,0,0.08,0,0.08,0.08,0.08,0.08,0.08]
[null,"D25",0,0.08,0,0,0.08,0.05,0.08,0.05,0.08,0,0.08,0.08,0,0,0.08,0.08,0.08,0,0.05,0.08,0.08,0.08,0,0.05,0,0.08,0,0.08,0.08,0.08,0.08,0.05]
[null,"D50",0,0.08,0,0,0.03,0.03,0.08,0.03,0.03,0,0.03,0.03,0,0,0.08,0.03,0.03,0,0.03,0.08,0.03,0.03,0,0,0,0.08,0,0.03,0.03,0.03,0.03,0.03]
[null,"DCO",0,0.08,0,0,0.08,0.08,0.08,0.08,0.08,0,0.08,0.08,0,0,0.08,0.08,0.08,0,0.08,0.08,0.08,0.08,0,0.08,0,0.08,0,0.08,0.08,0.08,0.08,0.08]
[null,"DID",0,0.08,0,0,0.08,0.08,0.08,0.08,0.08,0,0.08,0.08,0,0,0.08,0.08,0.08,0,0.08,0.08,0.08,0.08,0,0.08,0,0.08,0,0.08,0.08,0.08,0.08,0.08]
[null,"DPC",0.03,0.03,0.03,0.03,0.03,0.03,0.03,0.03,0.03,0.03,0.03,0.03,0.03,0.03,0.03,0.03,0.03,0.03,0.03,0.03,0.03,0.03,0.03,0,0.03,0.03,0.03,0.03,0.03,0.03,0.03,0.03]
[null,"DPR",0.08,0.08,0.08,0.08,0.08,0.08,0.08,0.08,0.08,0.08,0.08,0.08,0.08,0.08,0.08,0.08,0.08,0.08,0.08,0.08,0.08,0.08,0.08,0.08,0.08,0.08,0.08,0.08,0.08,0.08,0.08,0.08]
[null,"PAL",0.15,0.15,0.15,0.15,0.15,0,0.15,0.15,0.15,0.15,0.15,0.15,0.15,0.15,0.15,0.15,0.15,0.15,0.15,0.15,0.15,0.15,0.15,0.15,0.15,0.15,0.15,0.15,0.15,0.15,0,0.15]
[null,"PCD",0,0,0,0,0,0,0,0,0,0,0,0,0,0,0,0,0,0,7.4999999999999997E-2,0,0,0,0,0,0,0,0,0,0,0,0,0]
[null,"PDF",0,0,0,0,0,0,0,0,0,0,0,0,0,0,0,0,0,0,0,0,0,0,0,0,0,0,0,0,0,0,0,0]
[null,"PIB",0.15,0.15,0.15,0.15,0.15,0.1,0.15,0.1,0.15,0.15,0.1,0.1,0.15,0.15,0.15,0.1,0.1,0.15,7.4999999999999997E-2,0.15,0.15,0.15,0.15,0.08,0.15,0.15,0.15,0.1,0.1,0.1,0.15,0.15]
[null,"PIC",0.15,0.15,0.15,0.15,0.15,0.1,0.15,0.1,0.15,0.15,0.1,0.15,0.15,0.15,0.15,0.1,0.1,0.15,0.1,0.15,0.15,0.15,0.15,0.08,0.15,0.15,0.15,0.15,0.1,0.1,0.15,0.15]
[null,"PIF",0.15,0.15,0.15,0.15,0.15,0.1,0.15,0.1,0.15,0.15,0.1,0.15,0.15,0.15,0.15,0.1,0.1,0.15,0.1,0.15,0.15,0.15,0.15,0.08,0.15,0.15,0.15,0.15,0.1,0.1,0.15,0.15]
[null,"PIG",0,0,0,0,0,0,0,0,0,0,0,0,0,0,0,0,0,0,0,0,0,0,0,0,0,0,0,0,0,0,0,0]
[null,"PII",0.15,0.15,0.15,0.15,0.15,0.1,0.15,0.1,0.15,0.15,0.1,0.1,0.15,0.15,0.15,0.1,0.1,0.15,0.1,0.15,0.15,0.15,0.15,0.08,0.15,0.15,0.15,0.1,0.1,0.1,0.15,0.15]
[null,"PMC",0.15,0.15,0.15,0.15,0.15,0.1,0.15,0.15,0.15,0.15,0.1,0.05,0.15,0.15,0.15,0.1,0.05,0.15,0.05,0.15,0.15,0.15,0.15,0.05,0.15,0.15,0.15,0.125,0.05,0.1,0.15,0.1]
[null,"PMI",0.15,0.15,0.15,0.15,0.15,0.1,0.15,0.15,0.15,0.15,0.1,0.05,0.15,0.15,0.15,0.1,0.05,0.15,0.05,0.15,0.15,0.15,0.15,0.05,0.15,0.15,0.15,0.125,0.05,0.1,0.15,0.1]
[null,"PMU",0,0,0,0,0,0,0,0,0,0,0,0,0,0,0,0,0,0,0,0,0,0,0,0,0,0,0,0,0,0,0,0]
[null,"POT",0.15,0.15,0.15,0.15,0.15,0.15,0.15,0.15,0.15,0.15,0.15,0.15,0.15,0.15,0.15,0.15,0.15,0.15,0.15,0.15,0.15,0.15,0.15,0.15,0.15,0.15,0.15,0.15,0.15,0.15,0.15,0.15]
[null,"PPA",0.15,0.15,0.15,0.15,0.15,0.15,0.15,0.15,0.15,0.15,0.15,0.15,0.15,0.15,0.15,0.15,0.15,0.15,0.15,0.15,0.15,0.15,0.15,0.15,0.15,0.15,0.15,0.15,0.15,0.15,0.15,0.15]
[null,"PPG",0,0,0,0,0,0.15,0,0,0,0,0,0,0,0,0,0,0,0,0,0,0,0,0,0,0,0,0,0,0,0,0,0]
[null,"PPP",0,0,0,0,0,0.15,0,0,0,0,0,0,0,0,0,0,0,0,0,0,0,0,0,0,0,0,0,0,0,0,0,0]
[null,"PPS",0.15,0.15,0.15,0.15,0.15,0.15,0.15,0.15,0.15,0,0.15,0.05,0.15,0.15,0.15,0.15,0.15,0.15,0.15,0.15,0.15,0.15,0.15,0.05,0.15,0.15,0.15,0.15,0.15,0.15,0.15,0.15]
[null,"PRC",0.15,0.15,0.15,0.15,0.15,0.1,0.15,0.1,0.15,0.15,0.1,0.1,0.15,0.15,0.15,0.1,0.05,0.15,0.1,0.15,0.15,0.15,0.15,0.05,0.15,0.15,0.15,0.15,0.1,0.1,0.15,0.1]
[null,"PRE",0.15,0.15,0.15,0.15,0.15,0.1,0.15,0.1,0.15,0.15,0.1,0.1,0.15,0.15,0.15,0.1,0.05,0.15,0.1,0.15,0.15,0.15,0.15,0.05,0.15,0.15,0.15,0.15,0.1,0.1,0,0.1]
[null,"PRF",0.15,0.15,0.15,0.15,0.15,0.1,0.15,0.1,0.15,0.15,0.1,0.1,0.15,0.15,0.15,0.1,0.05,0.15,0.1,0.15,0.15,0.15,0.15,0.05,0.15,0.15,0.15,0.15,0.1,0.1,0.15,0.1]
[null,"PRI",0.15,0.15,0.15,0.15,0.15,0.1,0.15,0.1,0.15,0.15,0.1,0.1,0.15,0.15,0.15,0.1,0.05,0.15,0.1,0.15,0.15,0.15,0.15,0.05,0.15,0.15,0.15,0.15,0.1,0.1,0.15,0.1]
[null,"PRL",0.15,0.15,0.15,0.15,0.15,0,0.15,0.1,0.15,0.15,0,0,0.15,0.15,0.15,0.1,0,0.15,0.1,0.15,0.15,0.15,0.15,0.05,0.15,0.15,0.15,0,0,0,0,0.1]
[null,"PRT",0.15,0.15,0.15,0.15,0.15,0.15,0.15,0.15,0.15,0.15,0.15,0.15,0.15,0.15,0.15,0.15,0.15,0.15,0.15,0.15,0.15,0.15,0.15,0.15,0.15,0.15,0.15,0.15,0.15,0.15,0.15,0.15]

{"sheet":"WHTWorksheet","index":3,"n_rows":1482,"n_cols":13,"rows_kept":1482,"cut":false,"hidden":false,"merged":[]}
[null,"Taxpayer Account Number",null,"Transaction Date",null,null,"Total Gross Payments","Total WHT Tax","Total Net Payments","Count of Entries"]
[null,null,null,null,null,{"$f":"DATE(YEAR(D2),12,31)","v":"1900-12-31"},{"$f":"SUM(G5:G1482)","v":0},{"$f":"SUM(H5:H1482)","v":0},{"$f":"SUM(I5:I1482)","v":0},{"$f":"COUNTIF(G5:G1482,\">0\")","v":0}]
[null,null,null,{"$f":"IF(AND(ISERROR(DATEVALUE(TEXT(D2,\"dd-mmm-yyyy\"))),D2<>\"\"), \"INVALID DATE\",\"\")","v":""}]
["Payee Name","Payee Domicile Country",null,"Payment Type",null,"WHT Rate","Gross Payment","WHT TAX","Net Payment","Payee Address:Street","Payee Address:City","Payee Address:County/State/Region","Payee Post Code"]
[null,null,{"$f":"IF(ISBLANK(B5),\"\",VLOOKUP(B5,Country!A:B,2))","v":""},null,{"$f":"IF(ISBLANK(D5),\"\",VLOOKUP(D5,Income!A:B,2))","v":""},{"$f":"IF(OR(C5=\"\",E5=\"\"),\"\",IF(ISNA(INDEX(RateRange,INDEX(RateRange,MATCH(E5,IncomeTypes,0),MATCH(C5,Countries,0)))),INDEX(RateRange,MATCH(E5,IncomeTypes,0),MATCH(\"OTH\",Countries,0)),INDEX(RateRange,MATCH(E5,IncomeTypes,0),MATCH(C5,Countries,0))))","v":""},null,{"$f":"IF(F5=\"\",\"\",ROUND(G5*F5,2))","v":""},{"$f":"IF(H5=\"\",\"\",G5-H5)","v":""}]
[null,null,{"$f":"IF(ISBLANK(B6),\"\",VLOOKUP(B6,Country!A:B,2))","v":""},null,{"$f":"IF(ISBLANK(D6),\"\",VLOOKUP(D6,Income!A:B,2))","v":""},"",null,"",""]
[null,null,{"$f":"IF(ISBLANK(B7),\"\",VLOOKUP(B7,Country!A:B,2))","v":""},null,{"$f":"IF(ISBLANK(D7),\"\",VLOOKUP(D7,Income!A:B,2))","v":""},"",null,"",""]
[null,null,{"$f":"IF(ISBLANK(B8),\"\",VLOOKUP(B8,Country!A:B,2))","v":""},null,{"$f":"IF(ISBLANK(D8),\"\",VLOOKUP(D8,Income!A:B,2))","v":""},"",null,"",""]
[null,null,{"$f":"IF(ISBLANK(B9),\"\",VLOOKUP(B9,Country!A:B,2))","v":""},null,{"$f":"IF(ISBLANK(D9),\"\",VLOOKUP(D9,Income!A:B,2))","v":""},"",null,"",""]
[null,null,{"$f":"IF(ISBLANK(B10),\"\",VLOOKUP(B10,Country!A:B,2))","v":""},null,{"$f":"IF(ISBLANK(D10),\"\",VLOOKUP(D10,Income!A:B,2))","v":""},"",null,"",""]
[null,null,{"$f":"IF(ISBLANK(B11),\"\",VLOOKUP(B11,Country!A:B,2))","v":""},null,{"$f":"IF(ISBLANK(D11),\"\",VLOOKUP(D11,Income!A:B,2))","v":""},"",null,"",""]
[null,null,{"$f":"IF(ISBLANK(B12),\"\",VLOOKUP(B12,Country!A:B,2))","v":""},null,{"$f":"IF(ISBLANK(D12),\"\",VLOOKUP(D12,Income!A:B,2))","v":""},"",null,"",{"$f":"IF(H12=\"\",\"\",G12-H12)","v":""}]
[null,null,{"$f":"IF(ISBLANK(B13),\"\",VLOOKUP(B13,Country!A:B,2))","v":""},null,{"$f":"IF(ISBLANK(D13),\"\",VLOOKUP(D13,Income!A:B,2))","v":""},"",null,"",""]
[null,null,{"$f":"IF(ISBLANK(B14),\"\",VLOOKUP(B14,Country!A:B,2))","v":""},null,{"$f":"IF(ISBLANK(D14),\"\",VLOOKUP(D14,Income!A:B,2))","v":""},"",null,"",""]
[null,null,{"$f":"IF(ISBLANK(B15),\"\",VLOOKUP(B15,Country!A:B,2))","v":""},null,{"$f":"IF(ISBLANK(D15),\"\",VLOOKUP(D15,Income!A:B,2))","v":""},"",null,"",""]
[null,null,{"$f":"IF(ISBLANK(B16),\"\",VLOOKUP(B16,Country!A:B,2))","v":""},null,{"$f":"IF(ISBLANK(D16),\"\",VLOOKUP(D16,Income!A:B,2))","v":""},"",null,"",""]
[null,null,{"$f":"IF(ISBLANK(B17),\"\",VLOOKUP(B17,Country!A:B,2))","v":""},null,{"$f":"IF(ISBLANK(D17),\"\",VLOOKUP(D17,Income!A:B,2))","v":""},"",null,"",""]
[null,null,{"$f":"IF(ISBLANK(B18),\"\",VLOOKUP(B18,Country!A:B,2))","v":""},null,{"$f":"IF(ISBLANK(D18),\"\",VLOOKUP(D18,Income!A:B,2))","v":""},"",null,"",""]
[null,null,{"$f":"IF(ISBLANK(B19),\"\",VLOOKUP(B19,Country!A:B,2))","v":""},null,{"$f":"IF(ISBLANK(D19),\"\",VLOOKUP(D19,Income!A:B,2))","v":""},"",null,"",""]
[null,null,{"$f":"IF(ISBLANK(B20),\"\",VLOOKUP(B20,Country!A:B,2))","v":""},null,{"$f":"IF(ISBLANK(D20),\"\",VLOOKUP(D20,Income!A:B,2))","v":""},"",null,"",""]
[null,null,{"$f":"IF(ISBLANK(B21),\"\",VLOOKUP(B21,Country!A:B,2))","v":""},null,{"$f":"IF(ISBLANK(D21),\"\",VLOOKUP(D21,Income!A:B,2))","v":""},"",null,"",""]
[null,null,{"$f":"IF(ISBLANK(B22),\"\",VLOOKUP(B22,Country!A:B,2))","v":""},null,{"$f":"IF(ISBLANK(D22),\"\",VLOOKUP(D22,Income!A:B,2))","v":""},"",null,"",""]
[null,null,{"$f":"IF(ISBLANK(B23),\"\",VLOOKUP(B23,Country!A:B,2))","v":""},null,{"$f":"IF(ISBLANK(D23),\"\",VLOOKUP(D23,Income!A:B,2))","v":""},"",null,"",""]
[null,null,{"$f":"IF(ISBLANK(B24),\"\",VLOOKUP(B24,Country!A:B,2))","v":""},null,{"$f":"IF(ISBLANK(D24),\"\",VLOOKUP(D24,Income!A:B,2))","v":""},"",null,"",""]
[null,null,{"$f":"IF(ISBLANK(B25),\"\",VLOOKUP(B25,Country!A:B,2))","v":""},null,{"$f":"IF(ISBLANK(D25),\"\",VLOOKUP(D25,Income!A:B,2))","v":""},"",null,"",""]
[null,null,{"$f":"IF(ISBLANK(B26),\"\",VLOOKUP(B26,Country!A:B,2))","v":""},null,{"$f":"IF(ISBLANK(D26),\"\",VLOOKUP(D26,Income!A:B,2))","v":""},"",null,"",""]
[null,null,{"$f":"IF(ISBLANK(B27),\"\",VLOOKUP(B27,Country!A:B,2))","v":""},null,{"$f":"IF(ISBLANK(D27),\"\",VLOOKUP(D27,Income!A:B,2))","v":""},"",null,"",""]
[null,null,{"$f":"IF(ISBLANK(B28),\"\",VLOOKUP(B28,Country!A:B,2))","v":""},null,{"$f":"IF(ISBLANK(D28),\"\",VLOOKUP(D28,Income!A:B,2))","v":""},"",null,"",""]
[null,null,{"$f":"IF(ISBLANK(B29),\"\",VLOOKUP(B29,Country!A:B,2))","v":""},null,{"$f":"IF(ISBLANK(D29),\"\",VLOOKUP(D29,Income!A:B,2))","v":""},"",null,"",""]
[null,null,{"$f":"IF(ISBLANK(B30),\"\",VLOOKUP(B30,Country!A:B,2))","v":""},null,{"$f":"IF(ISBLANK(D30),\"\",VLOOKUP(D30,Income!A:B,2))","v":""},"",null,"",""]
[null,null,{"$f":"IF(ISBLANK(B31),\"\",VLOOKUP(B31,Country!A:B,2))","v":""},null,{"$f":"IF(ISBLANK(D31),\"\",VLOOKUP(D31,Income!A:B,2))","v":""},"",null,"",""]
[null,null,{"$f":"IF(ISBLANK(B32),\"\",VLOOKUP(B32,Country!A:B,2))","v":""},null,{"$f":"IF(ISBLANK(D32),\"\",VLOOKUP(D32,Income!A:B,2))","v":""},"",null,"",""]
[null,null,{"$f":"IF(ISBLANK(B33),\"\",VLOOKUP(B33,Country!A:B,2))","v":""},null,{"$f":"IF(ISBLANK(D33),\"\",VLOOKUP(D33,Income!A:B,2))","v":""},"",null,"",""]
[null,null,{"$f":"IF(ISBLANK(B34),\"\",VLOOKUP(B34,Country!A:B,2))","v":""},null,{"$f":"IF(ISBLANK(D34),\"\",VLOOKUP(D34,Income!A:B,2))","v":""},"",null,"",""]
[null,null,{"$f":"IF(ISBLANK(B35),\"\",VLOOKUP(B35,Country!A:B,2))","v":""},null,{"$f":"IF(ISBLANK(D35),\"\",VLOOKUP(D35,Income!A:B,2))","v":""},"",null,"",""]
[null,null,{"$f":"IF(ISBLANK(B36),\"\",VLOOKUP(B36,Country!A:B,2))","v":""},null,{"$f":"IF(ISBLANK(D36),\"\",VLOOKUP(D36,Income!A:B,2))","v":""},"",null,"",""]
[null,null,{"$f":"IF(ISBLANK(B37),\"\",VLOOKUP(B37,Country!A:B,2))","v":""},null,{"$f":"IF(ISBLANK(D37),\"\",VLOOKUP(D37,Income!A:B,2))","v":""},"",null,"",""]
[null,null,{"$f":"IF(ISBLANK(B38),\"\",VLOOKUP(B38,Country!A:B,2))","v":""},null,{"$f":"IF(ISBLANK(D38),\"\",VLOOKUP(D38,Income!A:B,2))","v":""},"",null,"",""]
[null,null,{"$f":"IF(ISBLANK(B39),\"\",VLOOKUP(B39,Country!A:B,2))","v":""},null,{"$f":"IF(ISBLANK(D39),\"\",VLOOKUP(D39,Income!A:B,2))","v":""},"",null,"",""]
[null,null,{"$f":"IF(ISBLANK(B40),\"\",VLOOKUP(B40,Country!A:B,2))","v":""},null,{"$f":"IF(ISBLANK(D40),\"\",VLOOKUP(D40,Income!A:B,2))","v":""},"",null,"",""]
[null,null,{"$f":"IF(ISBLANK(B41),\"\",VLOOKUP(B41,Country!A:B,2))","v":""},null,{"$f":"IF(ISBLANK(D41),\"\",VLOOKUP(D41,Income!A:B,2))","v":""},"",null,"",""]
[null,null,{"$f":"IF(ISBLANK(B42),\"\",VLOOKUP(B42,Country!A:B,2))","v":""},null,{"$f":"IF(ISBLANK(D42),\"\",VLOOKUP(D42,Income!A:B,2))","v":""},"",null,"",""]
[null,null,{"$f":"IF(ISBLANK(B43),\"\",VLOOKUP(B43,Country!A:B,2))","v":""},null,{"$f":"IF(ISBLANK(D43),\"\",VLOOKUP(D43,Income!A:B,2))","v":""},"",null,"",""]
[null,null,{"$f":"IF(ISBLANK(B44),\"\",VLOOKUP(B44,Country!A:B,2))","v":""},null,{"$f":"IF(ISBLANK(D44),\"\",VLOOKUP(D44,Income!A:B,2))","v":""},"",null,"",""]
[null,null,{"$f":"IF(ISBLANK(B45),\"\",VLOOKUP(B45,Country!A:B,2))","v":""},null,{"$f":"IF(ISBLANK(D45),\"\",VLOOKUP(D45,Income!A:B,2))","v":""},"",null,"",""]
[null,null,{"$f":"IF(ISBLANK(B46),\"\",VLOOKUP(B46,Country!A:B,2))","v":""},null,{"$f":"IF(ISBLANK(D46),\"\",VLOOKUP(D46,Income!A:B,2))","v":""},"",null,"",""]
[null,null,{"$f":"IF(ISBLANK(B47),\"\",VLOOKUP(B47,Country!A:B,2))","v":""},null,{"$f":"IF(ISBLANK(D47),\"\",VLOOKUP(D47,Income!A:B,2))","v":""},{"$f":"IF(OR(C47=\"\",E47=\"\"),\"\",IF(ISNA(INDEX(RateRange,INDEX(RateRange,MATCH(E47,IncomeTypes,0),MATCH(C47,Countries,0)))),INDEX(RateRange,MATCH(E47,IncomeTypes,0),MATCH(\"OTH\",Countries,0)),INDEX(RateRange,MATCH(E47,IncomeTypes,0),MATCH(C47,Countries,0))))","v":""},null,"",""]
[null,null,{"$f":"IF(ISBLANK(B48),\"\",VLOOKUP(B48,Country!A:B,2))","v":""},null,{"$f":"IF(ISBLANK(D48),\"\",VLOOKUP(D48,Income!A:B,2))","v":""},"",null,"",""]
[null,null,{"$f":"IF(ISBLANK(B49),\"\",VLOOKUP(B49,Country!A:B,2))","v":""},null,{"$f":"IF(ISBLANK(D49),\"\",VLOOKUP(D49,Income!A:B,2))","v":""},"",null,"",""]
[null,null,{"$f":"IF(ISBLANK(B50),\"\",VLOOKUP(B50,Country!A:B,2))","v":""},null,{"$f":"IF(ISBLANK(D50),\"\",VLOOKUP(D50,Income!A:B,2))","v":""},"",null,"",""]
[null,null,{"$f":"IF(ISBLANK(B51),\"\",VLOOKUP(B51,Country!A:B,2))","v":""},null,{"$f":"IF(ISBLANK(D51),\"\",VLOOKUP(D51,Income!A:B,2))","v":""},"",null,"",""]
[null,null,{"$f":"IF(ISBLANK(B52),\"\",VLOOKUP(B52,Country!A:B,2))","v":""},null,{"$f":"IF(ISBLANK(D52),\"\",VLOOKUP(D52,Income!A:B,2))","v":""},"",null,"",""]
[null,null,{"$f":"IF(ISBLANK(B53),\"\",VLOOKUP(B53,Country!A:B,2))","v":""},null,{"$f":"IF(ISBLANK(D53),\"\",VLOOKUP(D53,Income!A:B,2))","v":""},"",null,"",""]
[null,null,{"$f":"IF(ISBLANK(B54),\"\",VLOOKUP(B54,Country!A:B,2))","v":""},null,{"$f":"IF(ISBLANK(D54),\"\",VLOOKUP(D54,Income!A:B,2))","v":""},"",null,"",""]
[null,null,{"$f":"IF(ISBLANK(B55),\"\",VLOOKUP(B55,Country!A:B,2))","v":""},null,{"$f":"IF(ISBLANK(D55),\"\",VLOOKUP(D55,Income!A:B,2))","v":""},"",null,"",""]
[null,null,{"$f":"IF(ISBLANK(B56),\"\",VLOOKUP(B56,Country!A:B,2))","v":""},null,{"$f":"IF(ISBLANK(D56),\"\",VLOOKUP(D56,Income!A:B,2))","v":""},"",null,"",""]
[null,null,{"$f":"IF(ISBLANK(B57),\"\",VLOOKUP(B57,Country!A:B,2))","v":""},null,{"$f":"IF(ISBLANK(D57),\"\",VLOOKUP(D57,Income!A:B,2))","v":""},"",null,"",""]
[null,null,{"$f":"IF(ISBLANK(B58),\"\",VLOOKUP(B58,Country!A:B,2))","v":""},null,{"$f":"IF(ISBLANK(D58),\"\",VLOOKUP(D58,Income!A:B,2))","v":""},"",null,"",""]
[null,null,{"$f":"IF(ISBLANK(B59),\"\",VLOOKUP(B59,Country!A:B,2))","v":""},null,{"$f":"IF(ISBLANK(D59),\"\",VLOOKUP(D59,Income!A:B,2))","v":""},"",null,"",""]
[null,null,{"$f":"IF(ISBLANK(B60),\"\",VLOOKUP(B60,Country!A:B,2))","v":""},null,{"$f":"IF(ISBLANK(D60),\"\",VLOOKUP(D60,Income!A:B,2))","v":""},"",null,"",""]
[null,null,{"$f":"IF(ISBLANK(B61),\"\",VLOOKUP(B61,Country!A:B,2))","v":""},null,{"$f":"IF(ISBLANK(D61),\"\",VLOOKUP(D61,Income!A:B,2))","v":""},"",null,"",""]
[null,null,{"$f":"IF(ISBLANK(B62),\"\",VLOOKUP(B62,Country!A:B,2))","v":""},null,{"$f":"IF(ISBLANK(D62),\"\",VLOOKUP(D62,Income!A:B,2))","v":""},"",null,"",""]
[null,null,{"$f":"IF(ISBLANK(B63),\"\",VLOOKUP(B63,Country!A:B,2))","v":""},null,{"$f":"IF(ISBLANK(D63),\"\",VLOOKUP(D63,Income!A:B,2))","v":""},"",null,"",""]
[null,null,{"$f":"IF(ISBLANK(B64),\"\",VLOOKUP(B64,Country!A:B,2))","v":""},null,{"$f":"IF(ISBLANK(D64),\"\",VLOOKUP(D64,Income!A:B,2))","v":""},"",null,"",""]
[null,null,{"$f":"IF(ISBLANK(B65),\"\",VLOOKUP(B65,Country!A:B,2))","v":""},null,{"$f":"IF(ISBLANK(D65),\"\",VLOOKUP(D65,Income!A:B,2))","v":""},"",null,"",""]
[null,null,{"$f":"IF(ISBLANK(B66),\"\",VLOOKUP(B66,Country!A:B,2))","v":""},null,{"$f":"IF(ISBLANK(D66),\"\",VLOOKUP(D66,Income!A:B,2))","v":""},"",null,"",""]
[null,null,{"$f":"IF(ISBLANK(B67),\"\",VLOOKUP(B67,Country!A:B,2))","v":""},null,{"$f":"IF(ISBLANK(D67),\"\",VLOOKUP(D67,Income!A:B,2))","v":""},"",null,"",""]
[null,null,{"$f":"IF(ISBLANK(B68),\"\",VLOOKUP(B68,Country!A:B,2))","v":""},null,{"$f":"IF(ISBLANK(D68),\"\",VLOOKUP(D68,Income!A:B,2))","v":""},"",null,"",""]
[null,null,{"$f":"IF(ISBLANK(B69),\"\",VLOOKUP(B69,Country!A:B,2))","v":""},null,{"$f":"IF(ISBLANK(D69),\"\",VLOOKUP(D69,Income!A:B,2))","v":""},"",null,{"$f":"IF(F69=\"\",\"\",ROUND(G69*F69,2))","v":""},""]
[null,null,{"$f":"IF(ISBLANK(B70),\"\",VLOOKUP(B70,Country!A:B,2))","v":""},null,{"$f":"IF(ISBLANK(D70),\"\",VLOOKUP(D70,Income!A:B,2))","v":""},"",null,"",""]
[null,null,{"$f":"IF(ISBLANK(B71),\"\",VLOOKUP(B71,Country!A:B,2))","v":""},null,{"$f":"IF(ISBLANK(D71),\"\",VLOOKUP(D71,Income!A:B,2))","v":""},"",null,"",""]
[null,null,{"$f":"IF(ISBLANK(B72),\"\",VLOOKUP(B72,Country!A:B,2))","v":""},null,{"$f":"IF(ISBLANK(D72),\"\",VLOOKUP(D72,Income!A:B,2))","v":""},"",null,"",""]
[null,null,{"$f":"IF(ISBLANK(B73),\"\",VLOOKUP(B73,Country!A:B,2))","v":""},null,{"$f":"IF(ISBLANK(D73),\"\",VLOOKUP(D73,Income!A:B,2))","v":""},"",null,"",""]
[null,null,{"$f":"IF(ISBLANK(B74),\"\",VLOOKUP(B74,Country!A:B,2))","v":""},null,{"$f":"IF(ISBLANK(D74),\"\",VLOOKUP(D74,Income!A:B,2))","v":""},"",null,"",""]
[null,null,{"$f":"IF(ISBLANK(B75),\"\",VLOOKUP(B75,Country!A:B,2))","v":""},null,{"$f":"IF(ISBLANK(D75),\"\",VLOOKUP(D75,Income!A:B,2))","v":""},"",null,"",""]
[null,null,{"$f":"IF(ISBLANK(B76),\"\",VLOOKUP(B76,Country!A:B,2))","v":""},null,{"$f":"IF(ISBLANK(D76),\"\",VLOOKUP(D76,Income!A:B,2))","v":""},"",null,"",{"$f":"IF(H76=\"\",\"\",G76-H76)","v":""}]
[null,null,{"$f":"IF(ISBLANK(B77),\"\",VLOOKUP(B77,Country!A:B,2))","v":""},null,{"$f":"IF(ISBLANK(D77),\"\",VLOOKUP(D77,Income!A:B,2))","v":""},"",null,"",""]
[null,null,{"$f":"IF(ISBLANK(B78),\"\",VLOOKUP(B78,Country!A:B,2))","v":""},null,{"$f":"IF(ISBLANK(D78),\"\",VLOOKUP(D78,Income!A:B,2))","v":""},"",null,"",""]
[null,null,{"$f":"IF(ISBLANK(B79),\"\",VLOOKUP(B79,Country!A:B,2))","v":""},null,{"$f":"IF(ISBLANK(D79),\"\",VLOOKUP(D79,Income!A:B,2))","v":""},"",null,"",""]
[null,null,{"$f":"IF(ISBLANK(B80),\"\",VLOOKUP(B80,Country!A:B,2))","v":""},null,{"$f":"IF(ISBLANK(D80),\"\",VLOOKUP(D80,Income!A:B,2))","v":""},"",null,"",""]
{"$rows_left_out":1402}